CRAN Package Check Results for Package dtwclust

Last updated on 2017-12-14 13:48:04 CET.

Flavor Version Tinstall Tcheck Ttotal Status Flags
r-devel-linux-x86_64-debian-clang 5.0.0 93.02 74.91 167.93 FAIL
r-devel-linux-x86_64-debian-gcc 5.0.0 82.34 67.00 149.34 FAIL
r-devel-linux-x86_64-fedora-clang 5.0.0 473.29 ERROR
r-devel-linux-x86_64-fedora-gcc 5.0.0 463.70 ERROR
r-devel-windows-ix86+x86_64 5.0.0 336.00 600.00 936.00 OK
r-patched-linux-x86_64 5.0.0 101.91 294.95 396.86 ERROR
r-patched-solaris-x86 5.0.0 547.60 ERROR
r-release-linux-x86_64 5.0.0 100.61 294.02 394.63 OK
r-release-windows-ix86+x86_64 5.0.0 237.00 422.00 659.00 OK
r-release-osx-x86_64 5.0.0 NOTE
r-oldrel-windows-ix86+x86_64 5.0.0 277.00 506.00 783.00 OK
r-oldrel-osx-x86_64 5.0.0 NOTE

Check Details

Version: 5.0.0
Check: pragmas in C/C++ headers and code
Result: FAIL
    
Flavors: r-devel-linux-x86_64-debian-clang, r-devel-linux-x86_64-debian-gcc

Version: 5.0.0
Check: installed package size
Result: NOTE
     installed size is 6.9Mb
     sub-directories of 1Mb or more:
     doc 1.9Mb
     libs 4.2Mb
Flavors: r-devel-linux-x86_64-fedora-clang, r-devel-linux-x86_64-fedora-gcc, r-release-osx-x86_64, r-oldrel-osx-x86_64

Version: 5.0.0
Check: tests
Result: ERROR
     Running ‘testthat.R’ [122s/141s]
    Running the tests in ‘tests/testthat.R’ failed.
    Complete output:
     > library(dtwclust)
     Loading required package: proxy
    
     Attaching package: 'proxy'
    
     The following objects are masked from 'package:stats':
    
     as.dist, dist
    
     The following object is masked from 'package:base':
    
     as.matrix
    
     Loading required package: dtw
     Loaded dtw v1.18-1. See ?dtw for help, citation("dtw") for use in publication.
    
     dtwclust:
     Setting random number generator to L'Ecuyer-CMRG (see RNGkind()).
     To read the included vignettes type: browseVignettes("dtwclust").
     Please see news(package = "dtwclust") for important information.
     > library(foreach)
     > library(testthat)
     >
     > #' To test in a local machine:
     > #' Sys.setenv(NOT_CRAN = "true"); test_dir("tests/testthat/")
     > #' OR
     > #' devtools::test() ## broken since adding tsclustFamily, can't figure out why
     > #'
     > #' To disable parallel tests, before calling test() run:
     > #'
     > #' options(dtwclust_skip_par_tests = TRUE)
     > #'
     > testthat::test_check("dtwclust")
     ── 1. Failure: Errors in centroid argument are correctly detected by tsclust. ─
     `tsclust(data, centroid = "mean")` threw an error with unexpected class.
     Expected class: mean
     Actual class: simpleError/error/condition
    
     ── 2. Failure: Errors in centroid argument are correctly detected by tsclust. ─
     `tsclust(data, centroid = "mean")` threw an error with unexpected class.
     Expected class: median
     Actual class: simpleError/error/condition
    
     ══ testthat results ═══════════════════════════════════════════════════════════
     OK: 1609 SKIPPED: 5 FAILED: 2
     1. Failure: Errors in centroid argument are correctly detected by tsclust.
     2. Failure: Errors in centroid argument are correctly detected by tsclust.
    
     Error: testthat unit tests failed
     Execution halted
Flavor: r-devel-linux-x86_64-fedora-clang

Version: 5.0.0
Check: tests
Result: ERROR
     Running ‘testthat.R’ [119s/144s]
    Running the tests in ‘tests/testthat.R’ failed.
    Complete output:
     > library(dtwclust)
     Loading required package: proxy
    
     Attaching package: 'proxy'
    
     The following objects are masked from 'package:stats':
    
     as.dist, dist
    
     The following object is masked from 'package:base':
    
     as.matrix
    
     Loading required package: dtw
     Loaded dtw v1.18-1. See ?dtw for help, citation("dtw") for use in publication.
    
     dtwclust:
     Setting random number generator to L'Ecuyer-CMRG (see RNGkind()).
     To read the included vignettes type: browseVignettes("dtwclust").
     Please see news(package = "dtwclust") for important information.
     > library(foreach)
     > library(testthat)
     >
     > #' To test in a local machine:
     > #' Sys.setenv(NOT_CRAN = "true"); test_dir("tests/testthat/")
     > #' OR
     > #' devtools::test() ## broken since adding tsclustFamily, can't figure out why
     > #'
     > #' To disable parallel tests, before calling test() run:
     > #'
     > #' options(dtwclust_skip_par_tests = TRUE)
     > #'
     > testthat::test_check("dtwclust")
     ── 1. Failure: Errors in centroid argument are correctly detected by tsclust. ─
     `tsclust(data, centroid = "mean")` threw an error with unexpected class.
     Expected class: mean
     Actual class: simpleError/error/condition
    
     ── 2. Failure: Errors in centroid argument are correctly detected by tsclust. ─
     `tsclust(data, centroid = "mean")` threw an error with unexpected class.
     Expected class: median
     Actual class: simpleError/error/condition
    
     ══ testthat results ═══════════════════════════════════════════════════════════
     OK: 1609 SKIPPED: 5 FAILED: 2
     1. Failure: Errors in centroid argument are correctly detected by tsclust.
     2. Failure: Errors in centroid argument are correctly detected by tsclust.
    
     Error: testthat unit tests failed
     Execution halted
Flavor: r-devel-linux-x86_64-fedora-gcc

Version: 5.0.0
Check: tests
Result: ERROR
     Running ‘testthat.R’ [116s/147s]
    Running the tests in ‘tests/testthat.R’ failed.
    Complete output:
     > library(dtwclust)
     Loading required package: proxy
    
     Attaching package: 'proxy'
    
     The following objects are masked from 'package:stats':
    
     as.dist, dist
    
     The following object is masked from 'package:base':
    
     as.matrix
    
     Loading required package: dtw
     Loaded dtw v1.18-1. See ?dtw for help, citation("dtw") for use in publication.
    
     dtwclust:
     Setting random number generator to L'Ecuyer-CMRG (see RNGkind()).
     To read the included vignettes type: browseVignettes("dtwclust").
     Please see news(package = "dtwclust") for important information.
     > library(foreach)
     > library(testthat)
     >
     > #' To test in a local machine:
     > #' Sys.setenv(NOT_CRAN = "true"); test_dir("tests/testthat/")
     > #' OR
     > #' devtools::test() ## broken since adding tsclustFamily, can't figure out why
     > #'
     > #' To disable parallel tests, before calling test() run:
     > #'
     > #' options(dtwclust_skip_par_tests = TRUE)
     > #'
     > testthat::test_check("dtwclust")
     ── 1. Failure: Errors in centroid argument are correctly detected by tsclust. ─
     `tsclust(data, centroid = "mean")` threw an error with unexpected class.
     Expected class: mean
     Actual class: simpleError/error/condition
    
     ── 2. Failure: Errors in centroid argument are correctly detected by tsclust. ─
     `tsclust(data, centroid = "mean")` threw an error with unexpected class.
     Expected class: median
     Actual class: simpleError/error/condition
    
     ══ testthat results ═══════════════════════════════════════════════════════════
     OK: 1609 SKIPPED: 5 FAILED: 2
     1. Failure: Errors in centroid argument are correctly detected by tsclust.
     2. Failure: Errors in centroid argument are correctly detected by tsclust.
    
     Error: testthat unit tests failed
     Execution halted
Flavor: r-patched-linux-x86_64

Version: 5.0.0
Check: tests
Result: ERROR
     Running ‘testthat.R’ [170s/170s]
    Running the tests in ‘tests/testthat.R’ failed.
    Complete output:
     > library(dtwclust)
     Loading required package: proxy
    
     Attaching package: 'proxy'
    
     The following objects are masked from 'package:stats':
    
     as.dist, dist
    
     The following object is masked from 'package:base':
    
     as.matrix
    
     Loading required package: dtw
     Loaded dtw v1.18-1. See ?dtw for help, citation("dtw") for use in publication.
    
     dtwclust:
     Setting random number generator to L'Ecuyer-CMRG (see RNGkind()).
     To read the included vignettes type: browseVignettes("dtwclust").
     Please see news(package = "dtwclust") for important information.
     > library(foreach)
     > library(testthat)
     >
     > #' To test in a local machine:
     > #' Sys.setenv(NOT_CRAN = "true"); test_dir("tests/testthat/")
     > #' OR
     > #' devtools::test() ## broken since adding tsclustFamily, can't figure out why
     > #'
     > #' To disable parallel tests, before calling test() run:
     > #'
     > #' options(dtwclust_skip_par_tests = TRUE)
     > #'
     > testthat::test_check("dtwclust")
     ── 1. Failure: Errors in centroid argument are correctly detected by tsclust. ─
     `tsclust(data, centroid = "mean")` threw an error with unexpected class.
     Expected class: mean
     Actual class: simpleError/error/condition
    
     ── 2. Failure: Errors in centroid argument are correctly detected by tsclust. ─
     `tsclust(data, centroid = "mean")` threw an error with unexpected class.
     Expected class: median
     Actual class: simpleError/error/condition
    
     ══ testthat results ═══════════════════════════════════════════════════════════
     OK: 1609 SKIPPED: 5 FAILED: 2
     1. Failure: Errors in centroid argument are correctly detected by tsclust.
     2. Failure: Errors in centroid argument are correctly detected by tsclust.
    
     Error: testthat unit tests failed
     Execution halted
Flavor: r-patched-solaris-x86